{"text_format":"1","workbook":"xlsx","n_sheets":10,"sheets":["Helfer","Ergebnisliste","Teilnehmer","Herren","Damen","Schüler m","Startliste_1","Startliste_2","Protokoll","Urkundendruck"],"not_rendered":{"charts":0,"images":2,"macros":0,"external_links":0,"defined_names":49,"comments":0,"pivot_tables":0},"unopened":[],"bounds":{"document_bytes":16777216,"sheet_cells":100000,"rows_first":2000,"rows_last":500,"rows_between":2000,"halvings":0,"cell_chars":16384,"cell_head_chars":4096},"cells_cut":0,"cells_raw":0,"read":"whole","date_system":"1900"}

{"sheet":"Helfer","index":0,"n_rows":20,"n_cols":2,"rows_kept":20,"cut":false,"hidden":false,"merged":[[0,0,0,1]]}
["Bahnenbetreuung Jedermannturnier"]
["Bahn","BGSV Mitglied"]
[1,"Oliver Lindemann"]
[2,"Christof Herzberger"]
[3,"Michael Sattler"]
[4,"Norbert Jakob"]
[5,"Franz Krumay"]
[6,"Dennis Koch"]
[7,"Stephan Preißmann / Sven Wachtel"]
[8,"Harald Kantor"]
[9,"Robert Kantor"]
[10,"Gerd Paul"]
[11,"Rolf Koch"]
[12,"Ralf Herzog"]
[13,"Rolf Frank"]
[14,"Philipp Herzberger"]
[15,"Luca Hudert"]
[16,"David Hagemeyer"]
[17,"Eileen Herzberger"]
[18,"Franziska Hagemeyer"]

{"sheet":"Ergebnisliste","index":1,"n_rows":0,"n_cols":0,"rows_kept":0,"cut":false,"hidden":false,"merged":[]}

{"sheet":"Teilnehmer","index":2,"n_rows":34,"n_cols":15,"rows_kept":34,"cut":false,"hidden":false,"merged":[[20,3,20,5]]}
[]
[null,null,null,null,null,"Jedermannturnier 2019"]
[null,"Startnr.","Rang","Name","Vorname","Kat","Rd. 1","Rd. 2","Gesamt","Asse 1","Asse 2","Ges",null,null,"Rang Asse"]
[null,null,null,null,null,"Herren"]
[null,101,{"$f":"IF(I5=\"\",\"\",RANK(I5,$I$5:$I$20,2))","v":1},"Philippus","Achim","H",40,38,{"$f":"G5+H5","v":78},5,4,{"$f":"J5+K5","v":9},null,null,{"$f":"RANK(L5,L$4:L$34,0)","v":2}]
[null,102,{"$f":"IF(I6=\"\",\"\",RANK(I6,$I$5:$I$20,2))","v":2},"Bien","Martin","H",40,44,{"$f":"G6+H6","v":84},4,2,{"$f":"J6+K6","v":6},null,null,{"$f":"RANK(L6,L$4:L$34,0)","v":9}]
[null,103,{"$f":"IF(I7=\"\",\"\",RANK(I7,$I$5:$I$20,2))","v":3},"Lotz","Peter","H",45,40,{"$f":"G7+H7","v":85},3,4,{"$f":"J7+K7","v":7},null,null,{"$f":"RANK(L7,L$4:L$34,0)","v":5}]
[null,104,{"$f":"IF(I8=\"\",\"\",RANK(I8,$I$5:$I$20,2))","v":4},"Hudert","Marcus","H",41,47,{"$f":"G8+H8","v":88},4,3,{"$f":"J8+K8","v":7},null,null,{"$f":"RANK(L8,L$4:L$34,0)","v":5}]
[null,105,{"$f":"IF(I9=\"\",\"\",RANK(I9,$I$5:$I$20,2))","v":5},"Bischoff","Andreas","H",43,47,{"$f":"G9+H9","v":90},3,2,{"$f":"J9+K9","v":5},null,null,{"$f":"RANK(L9,L$4:L$34,0)","v":12}]
[null,106,{"$f":"IF(I10=\"\",\"\",RANK(I10,$I$5:$I$20,2))","v":6},"Thomas","Stefan","H",45,46,{"$f":"G10+H10","v":91},4,6,{"$f":"J10+K10","v":10},null,null,{"$f":"RANK(L10,L$4:L$34,0)","v":1}]
[null,107,{"$f":"IF(I11=\"\",\"\",RANK(I11,$I$5:$I$20,2))","v":7},"Kremer","Manfred","H",46,47,{"$f":"G11+H11","v":93},3,3,{"$f":"J11+K11","v":6},null,null,{"$f":"RANK(L11,L$4:L$34,0)","v":9}]
[null,108,{"$f":"IF(I12=\"\",\"\",RANK(I12,$I$5:$I$20,2))","v":8},"Hudert","Leon","H",51,44,{"$f":"G12+H12","v":95},3,4,{"$f":"J12+K12","v":7},null,null,{"$f":"RANK(L12,L$4:L$34,0)","v":5}]
[null,109,{"$f":"IF(I13=\"\",\"\",RANK(I13,$I$5:$I$20,2))","v":9},"Weber","Frank","H",51,46,{"$f":"G13+H13","v":97},3,2,{"$f":"J13+K13","v":5},null,null,{"$f":"RANK(L13,L$4:L$34,0)","v":12}]
[null,110,{"$f":"IF(I14=\"\",\"\",RANK(I14,$I$5:$I$20,2))","v":10},"Teischad","Stefan","H",48,53,{"$f":"G14+H14","v":101},2,3,{"$f":"J14+K14","v":5},null,null,{"$f":"RANK(L14,L$4:L$34,0)","v":12}]
[null,111,{"$f":"IF(I15=\"\",\"\",RANK(I15,$I$5:$I$20,2))","v":11},"Geisler","Knut","H",60,43,{"$f":"G15+H15","v":103},1,4,{"$f":"J15+K15","v":5},null,null,{"$f":"RANK(L15,L$4:L$34,0)","v":12}]
[null,112,{"$f":"IF(I16=\"\",\"\",RANK(I16,$I$5:$I$20,2))","v":12},"Reimann","Thomas","H",53,58,{"$f":"G16+H16","v":111},3,1,{"$f":"J16+K16","v":4},null,null,{"$f":"RANK(L16,L$4:L$34,0)","v":18}]
[null,113,{"$f":"IF(I17=\"\",\"\",RANK(I17,$I$5:$I$20,2))","v":12},"Kleemann","Petrick","H",56,55,{"$f":"G17+H17","v":111},2,3,{"$f":"J17+K17","v":5},null,null,{"$f":"RANK(L17,L$4:L$34,0)","v":12}]
[null,114,{"$f":"IF(I18=\"\",\"\",RANK(I18,$I$5:$I$20,2))","v":14},"Ding","Gary","H",66,54,{"$f":"G18+H18","v":120},1,2,{"$f":"J18+K18","v":3},null,null,{"$f":"RANK(L18,L$4:L$34,0)","v":22}]
[null,115,{"$f":"IF(I19=\"\",\"\",RANK(I19,$I$5:$I$20,2))","v":15},"Günther","Felix","H",61,62,{"$f":"G19+H19","v":123},3,0,{"$f":"J19+K19","v":3},null,null,{"$f":"RANK(L19,L$4:L$34,0)","v":22}]
[null,116,{"$f":"IF(I20=\"\",\"\",RANK(I20,$I$5:$I$20,2))","v":16},"van Ryßen","Artur","H",43,126,{"$f":"G20+H20","v":169},2,0,{"$f":"J20+K20","v":2},null,null,{"$f":"RANK(L20,L$4:L$34,0)","v":24}]
[null,null,{"$f":"IF(I21=\"\",\"\",RANK(I21,$I$5:$I$20,2))","v":""}]
[null,null,"",null,null,"Damen"]
[null,201,{"$f":"IF(I23=\"\",\"\",RANK(I23,$I$23:$I$30,2))","v":1},"Erle","Laura","D",41,44,{"$f":"G23+H23","v":85},6,3,{"$f":"J23+K23","v":9},null,null,{"$f":"RANK(L23,L$4:L$34,0)","v":2}]
[null,202,{"$f":"IF(I24=\"\",\"\",RANK(I24,$I$23:$I$30,2))","v":2},"Walther","Bianca","D",45,54,{"$f":"G24+H24","v":99},5,4,{"$f":"J24+K24","v":9},null,null,{"$f":"RANK(L24,L$4:L$34,0)","v":2}]
[null,203,{"$f":"IF(I25=\"\",\"\",RANK(I25,$I$23:$I$30,2))","v":3},"Bien","Angelika","D",51,50,{"$f":"G25+H25","v":101},3,4,{"$f":"J25+K25","v":7},null,null,{"$f":"RANK(L25,L$4:L$34,0)","v":5}]
[null,204,{"$f":"IF(I26=\"\",\"\",RANK(I26,$I$23:$I$30,2))","v":4},"Bischoff","Nicole","D",53,53,{"$f":"G26+H26","v":106},1,5,{"$f":"J26+K26","v":6},null,null,{"$f":"RANK(L26,L$4:L$34,0)","v":9}]
[null,205,{"$f":"IF(I27=\"\",\"\",RANK(I27,$I$23:$I$30,2))","v":5},"Mohr","Colette","D",59,57,{"$f":"G27+H27","v":116},3,1,{"$f":"J27+K27","v":4},null,null,{"$f":"RANK(L27,L$4:L$34,0)","v":18}]
[null,206,{"$f":"IF(I28=\"\",\"\",RANK(I28,$I$23:$I$30,2))","v":6},"Mohr","Aline","D",54,64,{"$f":"G28+H28","v":118},2,2,{"$f":"J28+K28","v":4},null,null,{"$f":"RANK(L28,L$4:L$34,0)","v":18}]
[null,207,{"$f":"IF(I29=\"\",\"\",RANK(I29,$I$23:$I$30,2))","v":7},"Kleemann","Kerstin","D",67,56,{"$f":"G29+H29","v":123},2,3,{"$f":"J29+K29","v":5},null,null,{"$f":"RANK(L29,L$4:L$34,0)","v":12}]
[null,208,{"$f":"IF(I30=\"\",\"\",RANK(I30,$I$23:$I$30,2))","v":8},"Ding","Jing","D",74,82,{"$f":"G30+H30","v":156},0,2,{"$f":"J30+K30","v":2},null,null,{"$f":"RANK(L30,L$4:L$34,0)","v":24}]
[null,null,{"$f":"IF(I31=\"\",\"\",RANK(I31,$I$5:$I$20,2))","v":""}]
[null,null,{"$f":"IF(I32=\"\",\"\",RANK(I32,$I$5:$I$20,2))","v":""},null,null,"Schüler"]
[null,401,{"$f":"IF(I33=\"\",\"\",RANK(I33,$I$33:$I$34,2))","v":1},"Thomas","Ben","Sch",59,48,{"$f":"G33+H33","v":107},1,3,{"$f":"J33+K33","v":4},null,null,{"$f":"RANK(L33,L$4:L$34,0)","v":18}]
[null,402,{"$f":"IF(I34=\"\",\"\",RANK(I34,$I$33:$I$34,2))","v":2},"Ding","Luis","Sch",85,73,{"$f":"G34+H34","v":158},1,0,{"$f":"J34+K34","v":1},null,null,{"$f":"RANK(L34,L$4:L$34,0)","v":26}]

{"sheet":"Herren","index":3,"n_rows":21,"n_cols":12,"rows_kept":21,"cut":false,"hidden":false,"merged":[[3,2,3,11]]}
[]
[null,null,null,null,null,"Jedermannturnier 2019"]
[null,"Startnr.","Rang","Name","Vorname","Kat","Rd. 1","Rd. 2","Gesamt","Asse 1","Asse 2","Ges"]
[null,null,"Herren"]
[]
[null,107,{"$f":"IF(I6=\"\",\"\",RANK(I6,$I$6:$I$21,2))","v":1},"Philippus","Achim","H",40,38,{"$f":"G6+H6","v":78},5,4,{"$f":"J6+K6","v":9}]
[null,101,2,"Bien","Martin","H",40,44,84,4,2,6]
[null,113,3,"Lotz","Peter","H",45,40,85,3,4,7]
[null,105,4,"Hudert","Marcus","H",41,47,88,4,3,7]
[null,114,5,"Bischoff","Andreas","H",43,47,90,3,2,5]
[null,111,6,"Thomas","Stefan","H",45,46,91,4,6,10]
[null,103,7,"Kremer","Manfred","H",46,47,93,3,3,6]
[null,106,8,"Hudert","Leon","H",51,44,95,3,4,7]
[null,110,9,"Weber","Frank","H",51,46,97,3,2,5]
[null,102,10,"Teischad","Stefan","H",48,53,101,2,3,5]
[null,109,11,"Geisler","Knut","H",60,43,103,1,4,5]
[null,108,12,"Kleemann","Petrick","H",56,55,111,2,3,5]
[null,104,12,"Reimann","Thomas","H",53,58,111,3,1,4]
[null,116,14,"Ding","Gary","H",66,54,120,1,2,3]
[null,115,15,"Günther","Felix","H",61,62,123,3,0,3]
[null,112,16,"van Ryßen","Artur","H",43,126,169,2,0,2]

{"sheet":"Damen","index":4,"n_rows":13,"n_cols":12,"rows_kept":13,"cut":false,"hidden":false,"merged":[[3,2,3,11]]}
[]
[null,null,null,null,null,"Jedermannturnier 2019"]
[null,"Startnr.","Rang","Name","Vorname","Kat","Rd. 1","Rd. 2","Gesamt","Asse 1","Asse 2","Ges"]
[null,null,"Damen"]
[]
[null,203,{"$f":"IF(I6=\"\",\"\",RANK(I6,$I$6:$I$13,2))","v":1},"Erle","Laura","D",41,44,{"$f":"G6+H6","v":85},6,3,{"$f":"J6+K6","v":9}]
[null,205,2,"Walther","Bianca","D",45,54,99,5,4,9]
[null,202,3,"Bien","Angelika","D",51,50,101,3,4,7]
[null,206,4,"Bischoff","Nicole","D",53,53,106,1,5,6]
[null,201,5,"Mohr","Colette","D",59,57,116,3,1,4]
[null,208,6,"Mohr","Aline","D",54,64,118,2,2,4]
[null,204,7,"Kleemann","Kerstin","D",67,56,123,2,3,5]
[null,207,8,"Ding","Jing","D",74,82,156,0,2,2]

{"sheet":"Schüler m","index":5,"n_rows":7,"n_cols":12,"rows_kept":7,"cut":false,"hidden":false,"merged":[[3,2,3,11]]}
[]
[null,null,null,null,null,"Jedermannturnier 2019"]
[null,"Startnr.","Rang","Name","Vorname","Kat","Rd. 1","Rd. 2","Gesamt","Asse 1","Asse 2","Ges"]
[null,null,"Schüler männlich"]
[]
[null,401,{"$f":"IF(I6=\"\",\"\",RANK(I6,$I$6:$I$7,2))","v":1},"Thomas","Ben","Schm",59,48,{"$f":"G6+H6","v":107},1,3,{"$f":"J6+K6","v":4}]
[null,402,{"$f":"IF(I7=\"\",\"\",RANK(I7,$I$6:$I$7,2))","v":2},"Ding","Luis","Schm",85,73,{"$f":"G7+H7","v":158},1,0,{"$f":"J7+K7","v":1}]

{"sheet":"Startliste_1","index":6,"n_rows":30,"n_cols":16,"rows_kept":30,"cut":false,"hidden":false,"merged":[[1,4,1,15]]}
[]
[null,null,null,null,"Startliste 1. Runde"]
[]
["Bahn","Start gruppe","Start Nr.","Name","Vorname","Kat",null,"Start Nr.","Name","Vorname","Kat",null,"Start Nr.","Name","Vorname","Kat"]
[1,1,101,{"$f":"VLOOKUP(C5,Teilnehmer!$B$5:$F$34,3,FALSE)","v":"Philippus"},{"$f":"VLOOKUP(C5,Teilnehmer!$B$5:$F$34,4,FALSE)","v":"Achim"},{"$f":"VLOOKUP(C5,Teilnehmer!$B$5:$F$34,5,FALSE)","v":"H"},null,102,{"$f":"VLOOKUP(H5,Teilnehmer!$B$5:$F$34,3,FALSE)","v":"Bien"},{"$f":"VLOOKUP(H5,Teilnehmer!$B$5:$F$34,4,FALSE)","v":"Martin"},{"$f":"VLOOKUP(H5,Teilnehmer!$B$5:$F$34,5,FALSE)","v":"H"},null,103,{"$f":"VLOOKUP(M5,Teilnehmer!$B$5:$F$34,3,FALSE)","v":"Lotz"},{"$f":"VLOOKUP(M5,Teilnehmer!$B$5:$F$34,4,FALSE)","v":"Peter"},{"$f":"VLOOKUP(M5,Teilnehmer!$B$5:$F$34,5,FALSE)","v":"H"}]
[2,2,203,{"$f":"VLOOKUP(C6,Teilnehmer!$B$5:$F$34,3,FALSE)","v":"Bien"},{"$f":"VLOOKUP(C6,Teilnehmer!$B$5:$F$34,4,FALSE)","v":"Angelika"},{"$f":"VLOOKUP(C6,Teilnehmer!$B$5:$F$34,5,FALSE)","v":"D"},null,105,{"$f":"VLOOKUP(H6,Teilnehmer!$B$5:$F$34,3,FALSE)","v":"Bischoff"},{"$f":"VLOOKUP(H6,Teilnehmer!$B$5:$F$34,4,FALSE)","v":"Andreas"},{"$f":"VLOOKUP(H6,Teilnehmer!$B$5:$F$34,5,FALSE)","v":"H"},null,106,{"$f":"VLOOKUP(M6,Teilnehmer!$B$5:$F$34,3,FALSE)","v":"Thomas"},{"$f":"VLOOKUP(M6,Teilnehmer!$B$5:$F$34,4,FALSE)","v":"Stefan"},{"$f":"VLOOKUP(M6,Teilnehmer!$B$5:$F$34,5,FALSE)","v":"H"}]
[3,3,107,{"$f":"VLOOKUP(C7,Teilnehmer!$B$5:$F$34,3,FALSE)","v":"Kremer"},{"$f":"VLOOKUP(C7,Teilnehmer!$B$5:$F$34,4,FALSE)","v":"Manfred"},{"$f":"VLOOKUP(C7,Teilnehmer!$B$5:$F$34,5,FALSE)","v":"H"},null,108,{"$f":"VLOOKUP(H7,Teilnehmer!$B$5:$F$34,3,FALSE)","v":"Hudert"},{"$f":"VLOOKUP(H7,Teilnehmer!$B$5:$F$34,4,FALSE)","v":"Leon"},{"$f":"VLOOKUP(H7,Teilnehmer!$B$5:$F$34,5,FALSE)","v":"H"},null,204,{"$f":"VLOOKUP(M7,Teilnehmer!$B$5:$F$34,3,FALSE)","v":"Bischoff"},{"$f":"VLOOKUP(M7,Teilnehmer!$B$5:$F$34,4,FALSE)","v":"Nicole"},{"$f":"VLOOKUP(M7,Teilnehmer!$B$5:$F$34,5,FALSE)","v":"D"}]
[4,4,201,{"$f":"VLOOKUP(C8,Teilnehmer!$B$5:$F$34,3,FALSE)","v":"Erle"},{"$f":"VLOOKUP(C8,Teilnehmer!$B$5:$F$34,4,FALSE)","v":"Laura"},{"$f":"VLOOKUP(C8,Teilnehmer!$B$5:$F$34,5,FALSE)","v":"D"},null,202,{"$f":"VLOOKUP(H8,Teilnehmer!$B$5:$F$34,3,FALSE)","v":"Walther"},{"$f":"VLOOKUP(H8,Teilnehmer!$B$5:$F$34,4,FALSE)","v":"Bianca"},{"$f":"VLOOKUP(H8,Teilnehmer!$B$5:$F$34,5,FALSE)","v":"D"},null,104,{"$f":"VLOOKUP(M8,Teilnehmer!$B$5:$F$34,3,FALSE)","v":"Hudert"},{"$f":"VLOOKUP(M8,Teilnehmer!$B$5:$F$34,4,FALSE)","v":"Marcus"},{"$f":"VLOOKUP(M8,Teilnehmer!$B$5:$F$34,5,FALSE)","v":"H"}]
[5,5,109,{"$f":"VLOOKUP(C9,Teilnehmer!$B$5:$F$34,3,FALSE)","v":"Weber"},{"$f":"VLOOKUP(C9,Teilnehmer!$B$5:$F$34,4,FALSE)","v":"Frank"},{"$f":"VLOOKUP(C9,Teilnehmer!$B$5:$F$34,5,FALSE)","v":"H"},null,110,{"$f":"VLOOKUP(H9,Teilnehmer!$B$5:$F$34,3,FALSE)","v":"Teischad"},{"$f":"VLOOKUP(H9,Teilnehmer!$B$5:$F$34,4,FALSE)","v":"Stefan"},{"$f":"VLOOKUP(H9,Teilnehmer!$B$5:$F$34,5,FALSE)","v":"H"},null,112,{"$f":"VLOOKUP(M9,Teilnehmer!$B$5:$F$34,3,FALSE)","v":"Reimann"},{"$f":"VLOOKUP(M9,Teilnehmer!$B$5:$F$34,4,FALSE)","v":"Thomas"},{"$f":"VLOOKUP(M9,Teilnehmer!$B$5:$F$34,5,FALSE)","v":"H"}]
[6,6,111,{"$f":"VLOOKUP(C10,Teilnehmer!$B$5:$F$34,3,FALSE)","v":"Geisler"},{"$f":"VLOOKUP(C10,Teilnehmer!$B$5:$F$34,4,FALSE)","v":"Knut"},{"$f":"VLOOKUP(C10,Teilnehmer!$B$5:$F$34,5,FALSE)","v":"H"},null,401,{"$f":"VLOOKUP(H10,Teilnehmer!$B$5:$F$34,3,FALSE)","v":"Thomas"},{"$f":"VLOOKUP(H10,Teilnehmer!$B$5:$F$34,4,FALSE)","v":"Ben"},{"$f":"VLOOKUP(H10,Teilnehmer!$B$5:$F$34,5,FALSE)","v":"Sch"},null,114,{"$f":"VLOOKUP(M10,Teilnehmer!$B$5:$F$34,3,FALSE)","v":"Ding"},{"$f":"VLOOKUP(M10,Teilnehmer!$B$5:$F$34,4,FALSE)","v":"Gary"},{"$f":"VLOOKUP(M10,Teilnehmer!$B$5:$F$34,5,FALSE)","v":"H"}]
[7,7,205,{"$f":"VLOOKUP(C11,Teilnehmer!$B$5:$F$34,3,FALSE)","v":"Mohr"},{"$f":"VLOOKUP(C11,Teilnehmer!$B$5:$F$34,4,FALSE)","v":"Colette"},{"$f":"VLOOKUP(C11,Teilnehmer!$B$5:$F$34,5,FALSE)","v":"D"},null,206,{"$f":"VLOOKUP(H11,Teilnehmer!$B$5:$F$34,3,FALSE)","v":"Mohr"},{"$f":"VLOOKUP(H11,Teilnehmer!$B$5:$F$34,4,FALSE)","v":"Aline"},{"$f":"VLOOKUP(H11,Teilnehmer!$B$5:$F$34,5,FALSE)","v":"D"},null,113,{"$f":"VLOOKUP(M11,Teilnehmer!$B$5:$F$34,3,FALSE)","v":"Kleemann"},{"$f":"VLOOKUP(M11,Teilnehmer!$B$5:$F$34,4,FALSE)","v":"Petrick"},{"$f":"VLOOKUP(M11,Teilnehmer!$B$5:$F$34,5,FALSE)","v":"H"}]
[8,8,116,{"$f":"VLOOKUP(C12,Teilnehmer!$B$5:$F$34,3,FALSE)","v":"van Ryßen"},{"$f":"VLOOKUP(C12,Teilnehmer!$B$5:$F$34,4,FALSE)","v":"Artur"},{"$f":"VLOOKUP(C12,Teilnehmer!$B$5:$F$34,5,FALSE)","v":"H"},null,207,{"$f":"VLOOKUP(H12,Teilnehmer!$B$5:$F$34,3,FALSE)","v":"Kleemann"},{"$f":"VLOOKUP(H12,Teilnehmer!$B$5:$F$34,4,FALSE)","v":"Kerstin"},{"$f":"VLOOKUP(H12,Teilnehmer!$B$5:$F$34,5,FALSE)","v":"D"},null,402,{"$f":"VLOOKUP(M12,Teilnehmer!$B$5:$F$34,3,FALSE)","v":"Ding"},{"$f":"VLOOKUP(M12,Teilnehmer!$B$5:$F$34,4,FALSE)","v":"Luis"},{"$f":"VLOOKUP(M12,Teilnehmer!$B$5:$F$34,5,FALSE)","v":"Sch"}]
[9,9,115,{"$f":"VLOOKUP(C13,Teilnehmer!$B$5:$F$34,3,FALSE)","v":"Günther"},{"$f":"VLOOKUP(C13,Teilnehmer!$B$5:$F$34,4,FALSE)","v":"Felix"},{"$f":"VLOOKUP(C13,Teilnehmer!$B$5:$F$34,5,FALSE)","v":"H"},null,208,{"$f":"VLOOKUP(H13,Teilnehmer!$B$5:$F$34,3,FALSE)","v":"Ding"},{"$f":"VLOOKUP(H13,Teilnehmer!$B$5:$F$34,4,FALSE)","v":"Jing"},{"$f":"VLOOKUP(H13,Teilnehmer!$B$5:$F$34,5,FALSE)","v":"D"},null,null,{"$f":"VLOOKUP(M13,Teilnehmer!$B$5:$F$34,3,FALSE)","v":{"$error":"#N/A"}},{"$f":"VLOOKUP(M13,Teilnehmer!$B$5:$F$34,4,FALSE)","v":{"$error":"#N/A"}},{"$f":"VLOOKUP(M13,Teilnehmer!$B$5:$F$34,5,FALSE)","v":{"$error":"#N/A"}}]
[10,10,null,{"$f":"VLOOKUP(C14,Teilnehmer!$B$5:$F$34,3,FALSE)","v":{"$error":"#N/A"}},{"$f":"VLOOKUP(C14,Teilnehmer!$B$5:$F$34,4,FALSE)","v":{"$error":"#N/A"}},{"$f":"VLOOKUP(C14,Teilnehmer!$B$5:$F$34,5,FALSE)","v":{"$error":"#N/A"}},null,null,{"$f":"VLOOKUP(H14,Teilnehmer!$B$5:$F$34,3,FALSE)","v":{"$error":"#N/A"}},{"$f":"VLOOKUP(H14,Teilnehmer!$B$5:$F$34,4,FALSE)","v":{"$error":"#N/A"}},{"$f":"VLOOKUP(H14,Teilnehmer!$B$5:$F$34,5,FALSE)","v":{"$error":"#N/A"}},null,null,{"$f":"VLOOKUP(M14,Teilnehmer!$B$5:$F$34,3,FALSE)","v":{"$error":"#N/A"}},{"$f":"VLOOKUP(M14,Teilnehmer!$B$5:$F$34,4,FALSE)","v":{"$error":"#N/A"}},{"$f":"VLOOKUP(M14,Teilnehmer!$B$5:$F$34,5,FALSE)","v":{"$error":"#N/A"}}]
[11,11,null,{"$f":"VLOOKUP(C15,Teilnehmer!$B$5:$F$34,3,FALSE)","v":{"$error":"#N/A"}},{"$f":"VLOOKUP(C15,Teilnehmer!$B$5:$F$34,4,FALSE)","v":{"$error":"#N/A"}},{"$f":"VLOOKUP(C15,Teilnehmer!$B$5:$F$34,5,FALSE)","v":{"$error":"#N/A"}},null,null,{"$f":"VLOOKUP(H15,Teilnehmer!$B$5:$F$34,3,FALSE)","v":{"$error":"#N/A"}},{"$f":"VLOOKUP(H15,Teilnehmer!$B$5:$F$34,4,FALSE)","v":{"$error":"#N/A"}},{"$f":"VLOOKUP(H15,Teilnehmer!$B$5:$F$34,5,FALSE)","v":{"$error":"#N/A"}},null,null,{"$f":"VLOOKUP(M15,Teilnehmer!$B$5:$F$34,3,FALSE)","v":{"$error":"#N/A"}},{"$f":"VLOOKUP(M15,Teilnehmer!$B$5:$F$34,4,FALSE)","v":{"$error":"#N/A"}},{"$f":"VLOOKUP(M15,Teilnehmer!$B$5:$F$34,5,FALSE)","v":{"$error":"#N/A"}}]
[12,12,null,{"$f":"VLOOKUP(C16,Teilnehmer!$B$5:$F$34,3,FALSE)","v":{"$error":"#N/A"}},{"$f":"VLOOKUP(C16,Teilnehmer!$B$5:$F$34,4,FALSE)","v":{"$error":"#N/A"}},{"$f":"VLOOKUP(C16,Teilnehmer!$B$5:$F$34,5,FALSE)","v":{"$error":"#N/A"}},null,null,{"$f":"VLOOKUP(H16,Teilnehmer!$B$5:$F$34,3,FALSE)","v":{"$error":"#N/A"}},{"$f":"VLOOKUP(H16,Teilnehmer!$B$5:$F$34,4,FALSE)","v":{"$error":"#N/A"}},{"$f":"VLOOKUP(H16,Teilnehmer!$B$5:$F$34,5,FALSE)","v":{"$error":"#N/A"}},null,null,{"$f":"VLOOKUP(M16,Teilnehmer!$B$5:$F$34,3,FALSE)","v":{"$error":"#N/A"}},{"$f":"VLOOKUP(M16,Teilnehmer!$B$5:$F$34,4,FALSE)","v":{"$error":"#N/A"}},{"$f":"VLOOKUP(M16,Teilnehmer!$B$5:$F$34,5,FALSE)","v":{"$error":"#N/A"}}]
[13,13,null,{"$f":"VLOOKUP(C17,Teilnehmer!$B$5:$F$34,3,FALSE)","v":{"$error":"#N/A"}},{"$f":"VLOOKUP(C17,Teilnehmer!$B$5:$F$34,4,FALSE)","v":{"$error":"#N/A"}},{"$f":"VLOOKUP(C17,Teilnehmer!$B$5:$F$34,5,FALSE)","v":{"$error":"#N/A"}},null,null,{"$f":"VLOOKUP(H17,Teilnehmer!$B$5:$F$34,3,FALSE)","v":{"$error":"#N/A"}},{"$f":"VLOOKUP(H17,Teilnehmer!$B$5:$F$34,4,FALSE)","v":{"$error":"#N/A"}},{"$f":"VLOOKUP(H17,Teilnehmer!$B$5:$F$34,5,FALSE)","v":{"$error":"#N/A"}},null,null,{"$f":"VLOOKUP(M17,Teilnehmer!$B$5:$F$34,3,FALSE)","v":{"$error":"#N/A"}},{"$f":"VLOOKUP(M17,Teilnehmer!$B$5:$F$34,4,FALSE)","v":{"$error":"#N/A"}},{"$f":"VLOOKUP(M17,Teilnehmer!$B$5:$F$34,5,FALSE)","v":{"$error":"#N/A"}}]
[14,14,null,{"$f":"VLOOKUP(C18,Teilnehmer!$B$5:$F$34,3,FALSE)","v":{"$error":"#N/A"}},{"$f":"VLOOKUP(C18,Teilnehmer!$B$5:$F$34,4,FALSE)","v":{"$error":"#N/A"}},{"$f":"VLOOKUP(C18,Teilnehmer!$B$5:$F$34,5,FALSE)","v":{"$error":"#N/A"}},null,null,{"$f":"VLOOKUP(H18,Teilnehmer!$B$5:$F$34,3,FALSE)","v":{"$error":"#N/A"}},{"$f":"VLOOKUP(H18,Teilnehmer!$B$5:$F$34,4,FALSE)","v":{"$error":"#N/A"}},{"$f":"VLOOKUP(H18,Teilnehmer!$B$5:$F$34,5,FALSE)","v":{"$error":"#N/A"}},null,null,{"$f":"VLOOKUP(M18,Teilnehmer!$B$5:$F$34,3,FALSE)","v":{"$error":"#N/A"}},{"$f":"VLOOKUP(M18,Teilnehmer!$B$5:$F$34,4,FALSE)","v":{"$error":"#N/A"}},{"$f":"VLOOKUP(M18,Teilnehmer!$B$5:$F$34,5,FALSE)","v":{"$error":"#N/A"}}]
[15,15,null,{"$f":"VLOOKUP(C19,Teilnehmer!$B$5:$F$34,3,FALSE)","v":{"$error":"#N/A"}},{"$f":"VLOOKUP(C19,Teilnehmer!$B$5:$F$34,4,FALSE)","v":{"$error":"#N/A"}},{"$f":"VLOOKUP(C19,Teilnehmer!$B$5:$F$34,5,FALSE)","v":{"$error":"#N/A"}},null,null,{"$f":"VLOOKUP(H19,Teilnehmer!$B$5:$F$34,3,FALSE)","v":{"$error":"#N/A"}},{"$f":"VLOOKUP(H19,Teilnehmer!$B$5:$F$34,4,FALSE)","v":{"$error":"#N/A"}},{"$f":"VLOOKUP(H19,Teilnehmer!$B$5:$F$34,5,FALSE)","v":{"$error":"#N/A"}},null,null,{"$f":"VLOOKUP(M19,Teilnehmer!$B$5:$F$34,3,FALSE)","v":{"$error":"#N/A"}},{"$f":"VLOOKUP(M19,Teilnehmer!$B$5:$F$34,4,FALSE)","v":{"$error":"#N/A"}},{"$f":"VLOOKUP(M19,Teilnehmer!$B$5:$F$34,5,FALSE)","v":{"$error":"#N/A"}}]
[16,16,null,{"$f":"VLOOKUP(C20,Teilnehmer!$B$5:$F$34,3,FALSE)","v":{"$error":"#N/A"}},{"$f":"VLOOKUP(C20,Teilnehmer!$B$5:$F$34,4,FALSE)","v":{"$error":"#N/A"}},{"$f":"VLOOKUP(C20,Teilnehmer!$B$5:$F$34,5,FALSE)","v":{"$error":"#N/A"}},null,null,{"$f":"VLOOKUP(H20,Teilnehmer!$B$5:$F$34,3,FALSE)","v":{"$error":"#N/A"}},{"$f":"VLOOKUP(H20,Teilnehmer!$B$5:$F$34,4,FALSE)","v":{"$error":"#N/A"}},{"$f":"VLOOKUP(H20,Teilnehmer!$B$5:$F$34,5,FALSE)","v":{"$error":"#N/A"}},null,null,{"$f":"VLOOKUP(M20,Teilnehmer!$B$5:$F$34,3,FALSE)","v":{"$error":"#N/A"}},{"$f":"VLOOKUP(M20,Teilnehmer!$B$5:$F$34,4,FALSE)","v":{"$error":"#N/A"}},{"$f":"VLOOKUP(M20,Teilnehmer!$B$5:$F$34,5,FALSE)","v":{"$error":"#N/A"}}]
[17,17,null,{"$f":"VLOOKUP(C21,Teilnehmer!$B$5:$F$34,3,FALSE)","v":{"$error":"#N/A"}},{"$f":"VLOOKUP(C21,Teilnehmer!$B$5:$F$34,4,FALSE)","v":{"$error":"#N/A"}},{"$f":"VLOOKUP(C21,Teilnehmer!$B$5:$F$34,5,FALSE)","v":{"$error":"#N/A"}},null,null,{"$f":"VLOOKUP(H21,Teilnehmer!$B$5:$F$34,3,FALSE)","v":{"$error":"#N/A"}},{"$f":"VLOOKUP(H21,Teilnehmer!$B$5:$F$34,4,FALSE)","v":{"$error":"#N/A"}},{"$f":"VLOOKUP(H21,Teilnehmer!$B$5:$F$34,5,FALSE)","v":{"$error":"#N/A"}},null,null,{"$f":"VLOOKUP(M21,Teilnehmer!$B$5:$F$34,3,FALSE)","v":{"$error":"#N/A"}},{"$f":"VLOOKUP(M21,Teilnehmer!$B$5:$F$34,4,FALSE)","v":{"$error":"#N/A"}},{"$f":"VLOOKUP(M21,Teilnehmer!$B$5:$F$34,5,FALSE)","v":{"$error":"#N/A"}}]
[18,18,null,{"$f":"VLOOKUP(C22,Teilnehmer!$B$5:$F$34,3,FALSE)","v":{"$error":"#N/A"}},{"$f":"VLOOKUP(C22,Teilnehmer!$B$5:$F$34,4,FALSE)","v":{"$error":"#N/A"}},{"$f":"VLOOKUP(C22,Teilnehmer!$B$5:$F$34,5,FALSE)","v":{"$error":"#N/A"}},null,null,{"$f":"VLOOKUP(H22,Teilnehmer!$B$5:$F$34,3,FALSE)","v":{"$error":"#N/A"}},{"$f":"VLOOKUP(H22,Teilnehmer!$B$5:$F$34,4,FALSE)","v":{"$error":"#N/A"}},{"$f":"VLOOKUP(H22,Teilnehmer!$B$5:$F$34,5,FALSE)","v":{"$error":"#N/A"}},null,null,{"$f":"VLOOKUP(M22,Teilnehmer!$B$5:$F$34,3,FALSE)","v":{"$error":"#N/A"}},{"$f":"VLOOKUP(M22,Teilnehmer!$B$5:$F$34,4,FALSE)","v":{"$error":"#N/A"}},{"$f":"VLOOKUP(M22,Teilnehmer!$B$5:$F$34,5,FALSE)","v":{"$error":"#N/A"}}]
[1,19,null,{"$f":"VLOOKUP(C23,Teilnehmer!$B$5:$F$34,3,FALSE)","v":{"$error":"#N/A"}},{"$f":"VLOOKUP(C23,Teilnehmer!$B$5:$F$34,4,FALSE)","v":{"$error":"#N/A"}},{"$f":"VLOOKUP(C23,Teilnehmer!$B$5:$F$34,5,FALSE)","v":{"$error":"#N/A"}},null,null,{"$f":"VLOOKUP(H23,Teilnehmer!$B$5:$F$34,3,FALSE)","v":{"$error":"#N/A"}},{"$f":"VLOOKUP(H23,Teilnehmer!$B$5:$F$34,4,FALSE)","v":{"$error":"#N/A"}},{"$f":"VLOOKUP(H23,Teilnehmer!$B$5:$F$34,5,FALSE)","v":{"$error":"#N/A"}},null,null,{"$f":"VLOOKUP(M23,Teilnehmer!$B$5:$F$34,3,FALSE)","v":{"$error":"#N/A"}},{"$f":"VLOOKUP(M23,Teilnehmer!$B$5:$F$34,4,FALSE)","v":{"$error":"#N/A"}},{"$f":"VLOOKUP(M23,Teilnehmer!$B$5:$F$34,5,FALSE)","v":{"$error":"#N/A"}}]
[1,20,null,{"$f":"VLOOKUP(C24,Teilnehmer!$B$5:$F$34,3,FALSE)","v":{"$error":"#N/A"}},{"$f":"VLOOKUP(C24,Teilnehmer!$B$5:$F$34,4,FALSE)","v":{"$error":"#N/A"}},{"$f":"VLOOKUP(C24,Teilnehmer!$B$5:$F$34,5,FALSE)","v":{"$error":"#N/A"}},null,null,{"$f":"VLOOKUP(H24,Teilnehmer!$B$5:$F$34,3,FALSE)","v":{"$error":"#N/A"}},{"$f":"VLOOKUP(H24,Teilnehmer!$B$5:$F$34,4,FALSE)","v":{"$error":"#N/A"}},{"$f":"VLOOKUP(H24,Teilnehmer!$B$5:$F$34,5,FALSE)","v":{"$error":"#N/A"}},null,null,{"$f":"VLOOKUP(M24,Teilnehmer!$B$5:$F$34,3,FALSE)","v":{"$error":"#N/A"}},{"$f":"VLOOKUP(M24,Teilnehmer!$B$5:$F$34,4,FALSE)","v":{"$error":"#N/A"}},{"$f":"VLOOKUP(M24,Teilnehmer!$B$5:$F$34,5,FALSE)","v":{"$error":"#N/A"}}]
[1,21,null,{"$f":"VLOOKUP(C25,Teilnehmer!$B$5:$F$34,3,FALSE)","v":{"$error":"#N/A"}},{"$f":"VLOOKUP(C25,Teilnehmer!$B$5:$F$34,4,FALSE)","v":{"$error":"#N/A"}},{"$f":"VLOOKUP(C25,Teilnehmer!$B$5:$F$34,5,FALSE)","v":{"$error":"#N/A"}},null,null,{"$f":"VLOOKUP(H25,Teilnehmer!$B$5:$F$34,3,FALSE)","v":{"$error":"#N/A"}},{"$f":"VLOOKUP(H25,Teilnehmer!$B$5:$F$34,4,FALSE)","v":{"$error":"#N/A"}},{"$f":"VLOOKUP(H25,Teilnehmer!$B$5:$F$34,5,FALSE)","v":{"$error":"#N/A"}},null,null,{"$f":"VLOOKUP(M25,Teilnehmer!$B$5:$F$34,3,FALSE)","v":{"$error":"#N/A"}},{"$f":"VLOOKUP(M25,Teilnehmer!$B$5:$F$34,4,FALSE)","v":{"$error":"#N/A"}},{"$f":"VLOOKUP(M25,Teilnehmer!$B$5:$F$34,5,FALSE)","v":{"$error":"#N/A"}}]
[1,22,null,{"$f":"VLOOKUP(C26,Teilnehmer!$B$5:$F$34,3,FALSE)","v":{"$error":"#N/A"}},{"$f":"VLOOKUP(C26,Teilnehmer!$B$5:$F$34,4,FALSE)","v":{"$error":"#N/A"}},{"$f":"VLOOKUP(C26,Teilnehmer!$B$5:$F$34,5,FALSE)","v":{"$error":"#N/A"}},null,null,{"$f":"VLOOKUP(H26,Teilnehmer!$B$5:$F$34,3,FALSE)","v":{"$error":"#N/A"}},{"$f":"VLOOKUP(H26,Teilnehmer!$B$5:$F$34,4,FALSE)","v":{"$error":"#N/A"}},{"$f":"VLOOKUP(H26,Teilnehmer!$B$5:$F$34,5,FALSE)","v":{"$error":"#N/A"}},null,null,{"$f":"VLOOKUP(M26,Teilnehmer!$B$5:$F$34,3,FALSE)","v":{"$error":"#N/A"}},{"$f":"VLOOKUP(M26,Teilnehmer!$B$5:$F$34,4,FALSE)","v":{"$error":"#N/A"}},{"$f":"VLOOKUP(M26,Teilnehmer!$B$5:$F$34,5,FALSE)","v":{"$error":"#N/A"}}]
[1,23,null,{"$f":"VLOOKUP(C27,Teilnehmer!$B$5:$F$34,3,FALSE)","v":{"$error":"#N/A"}},{"$f":"VLOOKUP(C27,Teilnehmer!$B$5:$F$34,4,FALSE)","v":{"$error":"#N/A"}},{"$f":"VLOOKUP(C27,Teilnehmer!$B$5:$F$34,5,FALSE)","v":{"$error":"#N/A"}},null,null,{"$f":"VLOOKUP(H27,Teilnehmer!$B$5:$F$34,3,FALSE)","v":{"$error":"#N/A"}},{"$f":"VLOOKUP(H27,Teilnehmer!$B$5:$F$34,4,FALSE)","v":{"$error":"#N/A"}},{"$f":"VLOOKUP(H27,Teilnehmer!$B$5:$F$34,5,FALSE)","v":{"$error":"#N/A"}},null,null,{"$f":"VLOOKUP(M27,Teilnehmer!$B$5:$F$34,3,FALSE)","v":{"$error":"#N/A"}},{"$f":"VLOOKUP(M27,Teilnehmer!$B$5:$F$34,4,FALSE)","v":{"$error":"#N/A"}},{"$f":"VLOOKUP(M27,Teilnehmer!$B$5:$F$34,5,FALSE)","v":{"$error":"#N/A"}}]
[1,24,null,{"$f":"VLOOKUP(C28,Teilnehmer!$B$5:$F$34,3,FALSE)","v":{"$error":"#N/A"}},{"$f":"VLOOKUP(C28,Teilnehmer!$B$5:$F$34,4,FALSE)","v":{"$error":"#N/A"}},{"$f":"VLOOKUP(C28,Teilnehmer!$B$5:$F$34,5,FALSE)","v":{"$error":"#N/A"}},null,null,{"$f":"VLOOKUP(H28,Teilnehmer!$B$5:$F$34,3,FALSE)","v":{"$error":"#N/A"}},{"$f":"VLOOKUP(H28,Teilnehmer!$B$5:$F$34,4,FALSE)","v":{"$error":"#N/A"}},{"$f":"VLOOKUP(H28,Teilnehmer!$B$5:$F$34,5,FALSE)","v":{"$error":"#N/A"}},null,null,{"$f":"VLOOKUP(M28,Teilnehmer!$B$5:$F$34,3,FALSE)","v":{"$error":"#N/A"}},{"$f":"VLOOKUP(M28,Teilnehmer!$B$5:$F$34,4,FALSE)","v":{"$error":"#N/A"}},{"$f":"VLOOKUP(M28,Teilnehmer!$B$5:$F$34,5,FALSE)","v":{"$error":"#N/A"}}]
[1,25,null,{"$f":"VLOOKUP(C29,Teilnehmer!$B$5:$F$34,3,FALSE)","v":{"$error":"#N/A"}},{"$f":"VLOOKUP(C29,Teilnehmer!$B$5:$F$34,4,FALSE)","v":{"$error":"#N/A"}},{"$f":"VLOOKUP(C29,Teilnehmer!$B$5:$F$34,5,FALSE)","v":{"$error":"#N/A"}},null,null,{"$f":"VLOOKUP(H29,Teilnehmer!$B$5:$F$34,3,FALSE)","v":{"$error":"#N/A"}},{"$f":"VLOOKUP(H29,Teilnehmer!$B$5:$F$34,4,FALSE)","v":{"$error":"#N/A"}},{"$f":"VLOOKUP(H29,Teilnehmer!$B$5:$F$34,5,FALSE)","v":{"$error":"#N/A"}},null,null,{"$f":"VLOOKUP(M29,Teilnehmer!$B$5:$F$34,3,FALSE)","v":{"$error":"#N/A"}},{"$f":"VLOOKUP(M29,Teilnehmer!$B$5:$F$34,4,FALSE)","v":{"$error":"#N/A"}},{"$f":"VLOOKUP(M29,Teilnehmer!$B$5:$F$34,5,FALSE)","v":{"$error":"#N/A"}}]
[1,26,null,{"$f":"VLOOKUP(C30,Teilnehmer!$B$5:$F$34,3,FALSE)","v":{"$error":"#N/A"}},{"$f":"VLOOKUP(C30,Teilnehmer!$B$5:$F$34,4,FALSE)","v":{"$error":"#N/A"}},{"$f":"VLOOKUP(C30,Teilnehmer!$B$5:$F$34,5,FALSE)","v":{"$error":"#N/A"}},null,null,{"$f":"VLOOKUP(H30,Teilnehmer!$B$5:$F$34,3,FALSE)","v":{"$error":"#N/A"}},{"$f":"VLOOKUP(H30,Teilnehmer!$B$5:$F$34,4,FALSE)","v":{"$error":"#N/A"}},{"$f":"VLOOKUP(H30,Teilnehmer!$B$5:$F$34,5,FALSE)","v":{"$error":"#N/A"}},null,null,{"$f":"VLOOKUP(M30,Teilnehmer!$B$5:$F$34,3,FALSE)","v":{"$error":"#N/A"}},{"$f":"VLOOKUP(M30,Teilnehmer!$B$5:$F$34,4,FALSE)","v":{"$error":"#N/A"}},{"$f":"VLOOKUP(M30,Teilnehmer!$B$5:$F$34,5,FALSE)","v":{"$error":"#N/A"}}]

{"sheet":"Startliste_2","index":7,"n_rows":30,"n_cols":16,"rows_kept":30,"cut":false,"hidden":false,"merged":[[1,4,1,15]]}
[]
[null,null,null,null,"Startliste 2. Runde"]
[]
["Bahn","Start gruppe","Start Nr.","Name","Vorname","Kat",null,"Start Nr.","Name","Vorname","Kat",null,"Start Nr.","Name","Vorname","Kat"]
[1,1,402,{"$f":"VLOOKUP(C5,Teilnehmer!$B$5:$F$34,3,FALSE)","v":"Ding"},{"$f":"VLOOKUP(C5,Teilnehmer!$B$5:$F$34,4,FALSE)","v":"Luis"},{"$f":"VLOOKUP(C5,Teilnehmer!$B$5:$F$34,5,FALSE)","v":"Sch"},null,401,{"$f":"VLOOKUP(H5,Teilnehmer!$B$5:$F$34,3,FALSE)","v":"Thomas"},{"$f":"VLOOKUP(H5,Teilnehmer!$B$5:$F$34,4,FALSE)","v":"Ben"},{"$f":"VLOOKUP(H5,Teilnehmer!$B$5:$F$34,5,FALSE)","v":"Sch"},null,null,{"$f":"VLOOKUP(M5,Teilnehmer!$B$5:$F$34,3,FALSE)","v":{"$error":"#N/A"}},{"$f":"VLOOKUP(M5,Teilnehmer!$B$5:$F$34,4,FALSE)","v":{"$error":"#N/A"}},{"$f":"VLOOKUP(M5,Teilnehmer!$B$5:$F$34,5,FALSE)","v":{"$error":"#N/A"}}]
[2,2,207,{"$f":"VLOOKUP(C6,Teilnehmer!$B$5:$F$34,3,FALSE)","v":"Kleemann"},{"$f":"VLOOKUP(C6,Teilnehmer!$B$5:$F$34,4,FALSE)","v":"Kerstin"},{"$f":"VLOOKUP(C6,Teilnehmer!$B$5:$F$34,5,FALSE)","v":"D"},null,204,{"$f":"VLOOKUP(H6,Teilnehmer!$B$5:$F$34,3,FALSE)","v":"Bischoff"},{"$f":"VLOOKUP(H6,Teilnehmer!$B$5:$F$34,4,FALSE)","v":"Nicole"},{"$f":"VLOOKUP(H6,Teilnehmer!$B$5:$F$34,5,FALSE)","v":"D"},null,null,{"$f":"VLOOKUP(M6,Teilnehmer!$B$5:$F$34,3,FALSE)","v":{"$error":"#N/A"}},{"$f":"VLOOKUP(M6,Teilnehmer!$B$5:$F$34,4,FALSE)","v":{"$error":"#N/A"}},{"$f":"VLOOKUP(M6,Teilnehmer!$B$5:$F$34,5,FALSE)","v":{"$error":"#N/A"}}]
[3,3,201,{"$f":"VLOOKUP(C7,Teilnehmer!$B$5:$F$34,3,FALSE)","v":"Erle"},{"$f":"VLOOKUP(C7,Teilnehmer!$B$5:$F$34,4,FALSE)","v":"Laura"},{"$f":"VLOOKUP(C7,Teilnehmer!$B$5:$F$34,5,FALSE)","v":"D"},null,208,{"$f":"VLOOKUP(H7,Teilnehmer!$B$5:$F$34,3,FALSE)","v":"Ding"},{"$f":"VLOOKUP(H7,Teilnehmer!$B$5:$F$34,4,FALSE)","v":"Jing"},{"$f":"VLOOKUP(H7,Teilnehmer!$B$5:$F$34,5,FALSE)","v":"D"},null,206,{"$f":"VLOOKUP(M7,Teilnehmer!$B$5:$F$34,3,FALSE)","v":"Mohr"},{"$f":"VLOOKUP(M7,Teilnehmer!$B$5:$F$34,4,FALSE)","v":"Aline"},{"$f":"VLOOKUP(M7,Teilnehmer!$B$5:$F$34,5,FALSE)","v":"D"}]
[4,4,202,{"$f":"VLOOKUP(C8,Teilnehmer!$B$5:$F$34,3,FALSE)","v":"Walther"},{"$f":"VLOOKUP(C8,Teilnehmer!$B$5:$F$34,4,FALSE)","v":"Bianca"},{"$f":"VLOOKUP(C8,Teilnehmer!$B$5:$F$34,5,FALSE)","v":"D"},null,205,{"$f":"VLOOKUP(H8,Teilnehmer!$B$5:$F$34,3,FALSE)","v":"Mohr"},{"$f":"VLOOKUP(H8,Teilnehmer!$B$5:$F$34,4,FALSE)","v":"Colette"},{"$f":"VLOOKUP(H8,Teilnehmer!$B$5:$F$34,5,FALSE)","v":"D"},null,203,{"$f":"VLOOKUP(M8,Teilnehmer!$B$5:$F$34,3,FALSE)","v":"Bien"},{"$f":"VLOOKUP(M8,Teilnehmer!$B$5:$F$34,4,FALSE)","v":"Angelika"},{"$f":"VLOOKUP(M8,Teilnehmer!$B$5:$F$34,5,FALSE)","v":"D"}]
[5,5,116,{"$f":"VLOOKUP(C9,Teilnehmer!$B$5:$F$34,3,FALSE)","v":"van Ryßen"},{"$f":"VLOOKUP(C9,Teilnehmer!$B$5:$F$34,4,FALSE)","v":"Artur"},{"$f":"VLOOKUP(C9,Teilnehmer!$B$5:$F$34,5,FALSE)","v":"H"},null,115,{"$f":"VLOOKUP(H9,Teilnehmer!$B$5:$F$34,3,FALSE)","v":"Günther"},{"$f":"VLOOKUP(H9,Teilnehmer!$B$5:$F$34,4,FALSE)","v":"Felix"},{"$f":"VLOOKUP(H9,Teilnehmer!$B$5:$F$34,5,FALSE)","v":"H"},null,null,{"$f":"VLOOKUP(M9,Teilnehmer!$B$5:$F$34,3,FALSE)","v":{"$error":"#N/A"}},{"$f":"VLOOKUP(M9,Teilnehmer!$B$5:$F$34,4,FALSE)","v":{"$error":"#N/A"}},{"$f":"VLOOKUP(M9,Teilnehmer!$B$5:$F$34,5,FALSE)","v":{"$error":"#N/A"}}]
[6,6,109,{"$f":"VLOOKUP(C10,Teilnehmer!$B$5:$F$34,3,FALSE)","v":"Weber"},{"$f":"VLOOKUP(C10,Teilnehmer!$B$5:$F$34,4,FALSE)","v":"Frank"},{"$f":"VLOOKUP(C10,Teilnehmer!$B$5:$F$34,5,FALSE)","v":"H"},null,108,{"$f":"VLOOKUP(H10,Teilnehmer!$B$5:$F$34,3,FALSE)","v":"Hudert"},{"$f":"VLOOKUP(H10,Teilnehmer!$B$5:$F$34,4,FALSE)","v":"Leon"},{"$f":"VLOOKUP(H10,Teilnehmer!$B$5:$F$34,5,FALSE)","v":"H"},null,null,{"$f":"VLOOKUP(M10,Teilnehmer!$B$5:$F$34,3,FALSE)","v":{"$error":"#N/A"}},{"$f":"VLOOKUP(M10,Teilnehmer!$B$5:$F$34,4,FALSE)","v":{"$error":"#N/A"}},{"$f":"VLOOKUP(M10,Teilnehmer!$B$5:$F$34,5,FALSE)","v":{"$error":"#N/A"}}]
[7,7,104,{"$f":"VLOOKUP(C11,Teilnehmer!$B$5:$F$34,3,FALSE)","v":"Hudert"},{"$f":"VLOOKUP(C11,Teilnehmer!$B$5:$F$34,4,FALSE)","v":"Marcus"},{"$f":"VLOOKUP(C11,Teilnehmer!$B$5:$F$34,5,FALSE)","v":"H"},null,110,{"$f":"VLOOKUP(H11,Teilnehmer!$B$5:$F$34,3,FALSE)","v":"Teischad"},{"$f":"VLOOKUP(H11,Teilnehmer!$B$5:$F$34,4,FALSE)","v":"Stefan"},{"$f":"VLOOKUP(H11,Teilnehmer!$B$5:$F$34,5,FALSE)","v":"H"},null,106,{"$f":"VLOOKUP(M11,Teilnehmer!$B$5:$F$34,3,FALSE)","v":"Thomas"},{"$f":"VLOOKUP(M11,Teilnehmer!$B$5:$F$34,4,FALSE)","v":"Stefan"},{"$f":"VLOOKUP(M11,Teilnehmer!$B$5:$F$34,5,FALSE)","v":"H"}]
[8,8,102,{"$f":"VLOOKUP(C12,Teilnehmer!$B$5:$F$34,3,FALSE)","v":"Bien"},{"$f":"VLOOKUP(C12,Teilnehmer!$B$5:$F$34,4,FALSE)","v":"Martin"},{"$f":"VLOOKUP(C12,Teilnehmer!$B$5:$F$34,5,FALSE)","v":"H"},null,103,{"$f":"VLOOKUP(H12,Teilnehmer!$B$5:$F$34,3,FALSE)","v":"Lotz"},{"$f":"VLOOKUP(H12,Teilnehmer!$B$5:$F$34,4,FALSE)","v":"Peter"},{"$f":"VLOOKUP(H12,Teilnehmer!$B$5:$F$34,5,FALSE)","v":"H"},null,113,{"$f":"VLOOKUP(M12,Teilnehmer!$B$5:$F$34,3,FALSE)","v":"Kleemann"},{"$f":"VLOOKUP(M12,Teilnehmer!$B$5:$F$34,4,FALSE)","v":"Petrick"},{"$f":"VLOOKUP(M12,Teilnehmer!$B$5:$F$34,5,FALSE)","v":"H"}]
[9,9,111,{"$f":"VLOOKUP(C13,Teilnehmer!$B$5:$F$34,3,FALSE)","v":"Geisler"},{"$f":"VLOOKUP(C13,Teilnehmer!$B$5:$F$34,4,FALSE)","v":"Knut"},{"$f":"VLOOKUP(C13,Teilnehmer!$B$5:$F$34,5,FALSE)","v":"H"},null,112,{"$f":"VLOOKUP(H13,Teilnehmer!$B$5:$F$34,3,FALSE)","v":"Reimann"},{"$f":"VLOOKUP(H13,Teilnehmer!$B$5:$F$34,4,FALSE)","v":"Thomas"},{"$f":"VLOOKUP(H13,Teilnehmer!$B$5:$F$34,5,FALSE)","v":"H"},null,114,{"$f":"VLOOKUP(M13,Teilnehmer!$B$5:$F$34,3,FALSE)","v":"Ding"},{"$f":"VLOOKUP(M13,Teilnehmer!$B$5:$F$34,4,FALSE)","v":"Gary"},{"$f":"VLOOKUP(M13,Teilnehmer!$B$5:$F$34,5,FALSE)","v":"H"}]
[10,10,105,{"$f":"VLOOKUP(C14,Teilnehmer!$B$5:$F$34,3,FALSE)","v":"Bischoff"},{"$f":"VLOOKUP(C14,Teilnehmer!$B$5:$F$34,4,FALSE)","v":"Andreas"},{"$f":"VLOOKUP(C14,Teilnehmer!$B$5:$F$34,5,FALSE)","v":"H"},null,101,{"$f":"VLOOKUP(H14,Teilnehmer!$B$5:$F$34,3,FALSE)","v":"Philippus"},{"$f":"VLOOKUP(H14,Teilnehmer!$B$5:$F$34,4,FALSE)","v":"Achim"},{"$f":"VLOOKUP(H14,Teilnehmer!$B$5:$F$34,5,FALSE)","v":"H"},null,107,{"$f":"VLOOKUP(M14,Teilnehmer!$B$5:$F$34,3,FALSE)","v":"Kremer"},{"$f":"VLOOKUP(M14,Teilnehmer!$B$5:$F$34,4,FALSE)","v":"Manfred"},{"$f":"VLOOKUP(M14,Teilnehmer!$B$5:$F$34,5,FALSE)","v":"H"}]
[11,11,null,{"$f":"VLOOKUP(C15,Teilnehmer!$B$5:$F$34,3,FALSE)","v":{"$error":"#N/A"}},{"$f":"VLOOKUP(C15,Teilnehmer!$B$5:$F$34,4,FALSE)","v":{"$error":"#N/A"}},{"$f":"VLOOKUP(C15,Teilnehmer!$B$5:$F$34,5,FALSE)","v":{"$error":"#N/A"}},null,null,{"$f":"VLOOKUP(H15,Teilnehmer!$B$5:$F$34,3,FALSE)","v":{"$error":"#N/A"}},{"$f":"VLOOKUP(H15,Teilnehmer!$B$5:$F$34,4,FALSE)","v":{"$error":"#N/A"}},{"$f":"VLOOKUP(H15,Teilnehmer!$B$5:$F$34,5,FALSE)","v":{"$error":"#N/A"}},null,null,{"$f":"VLOOKUP(M15,Teilnehmer!$B$5:$F$34,3,FALSE)","v":{"$error":"#N/A"}},{"$f":"VLOOKUP(M15,Teilnehmer!$B$5:$F$34,4,FALSE)","v":{"$error":"#N/A"}},{"$f":"VLOOKUP(M15,Teilnehmer!$B$5:$F$34,5,FALSE)","v":{"$error":"#N/A"}}]
[12,12,null,{"$f":"VLOOKUP(C16,Teilnehmer!$B$5:$F$34,3,FALSE)","v":{"$error":"#N/A"}},{"$f":"VLOOKUP(C16,Teilnehmer!$B$5:$F$34,4,FALSE)","v":{"$error":"#N/A"}},{"$f":"VLOOKUP(C16,Teilnehmer!$B$5:$F$34,5,FALSE)","v":{"$error":"#N/A"}},null,null,{"$f":"VLOOKUP(H16,Teilnehmer!$B$5:$F$34,3,FALSE)","v":{"$error":"#N/A"}},{"$f":"VLOOKUP(H16,Teilnehmer!$B$5:$F$34,4,FALSE)","v":{"$error":"#N/A"}},{"$f":"VLOOKUP(H16,Teilnehmer!$B$5:$F$34,5,FALSE)","v":{"$error":"#N/A"}},null,null,{"$f":"VLOOKUP(M16,Teilnehmer!$B$5:$F$34,3,FALSE)","v":{"$error":"#N/A"}},{"$f":"VLOOKUP(M16,Teilnehmer!$B$5:$F$34,4,FALSE)","v":{"$error":"#N/A"}},{"$f":"VLOOKUP(M16,Teilnehmer!$B$5:$F$34,5,FALSE)","v":{"$error":"#N/A"}}]
[13,13,null,{"$f":"VLOOKUP(C17,Teilnehmer!$B$5:$F$34,3,FALSE)","v":{"$error":"#N/A"}},{"$f":"VLOOKUP(C17,Teilnehmer!$B$5:$F$34,4,FALSE)","v":{"$error":"#N/A"}},{"$f":"VLOOKUP(C17,Teilnehmer!$B$5:$F$34,5,FALSE)","v":{"$error":"#N/A"}},null,null,{"$f":"VLOOKUP(H17,Teilnehmer!$B$5:$F$34,3,FALSE)","v":{"$error":"#N/A"}},{"$f":"VLOOKUP(H17,Teilnehmer!$B$5:$F$34,4,FALSE)","v":{"$error":"#N/A"}},{"$f":"VLOOKUP(H17,Teilnehmer!$B$5:$F$34,5,FALSE)","v":{"$error":"#N/A"}},null,null,{"$f":"VLOOKUP(M17,Teilnehmer!$B$5:$F$34,3,FALSE)","v":{"$error":"#N/A"}},{"$f":"VLOOKUP(M17,Teilnehmer!$B$5:$F$34,4,FALSE)","v":{"$error":"#N/A"}},{"$f":"VLOOKUP(M17,Teilnehmer!$B$5:$F$34,5,FALSE)","v":{"$error":"#N/A"}}]
[14,14,null,{"$f":"VLOOKUP(C18,Teilnehmer!$B$5:$F$34,3,FALSE)","v":{"$error":"#N/A"}},{"$f":"VLOOKUP(C18,Teilnehmer!$B$5:$F$34,4,FALSE)","v":{"$error":"#N/A"}},{"$f":"VLOOKUP(C18,Teilnehmer!$B$5:$F$34,5,FALSE)","v":{"$error":"#N/A"}},null,null,{"$f":"VLOOKUP(H18,Teilnehmer!$B$5:$F$34,3,FALSE)","v":{"$error":"#N/A"}},{"$f":"VLOOKUP(H18,Teilnehmer!$B$5:$F$34,4,FALSE)","v":{"$error":"#N/A"}},{"$f":"VLOOKUP(H18,Teilnehmer!$B$5:$F$34,5,FALSE)","v":{"$error":"#N/A"}},null,null,{"$f":"VLOOKUP(M18,Teilnehmer!$B$5:$F$34,3,FALSE)","v":{"$error":"#N/A"}},{"$f":"VLOOKUP(M18,Teilnehmer!$B$5:$F$34,4,FALSE)","v":{"$error":"#N/A"}},{"$f":"VLOOKUP(M18,Teilnehmer!$B$5:$F$34,5,FALSE)","v":{"$error":"#N/A"}}]
[15,15,null,{"$f":"VLOOKUP(C19,Teilnehmer!$B$5:$F$34,3,FALSE)","v":{"$error":"#N/A"}},{"$f":"VLOOKUP(C19,Teilnehmer!$B$5:$F$34,4,FALSE)","v":{"$error":"#N/A"}},{"$f":"VLOOKUP(C19,Teilnehmer!$B$5:$F$34,5,FALSE)","v":{"$error":"#N/A"}},null,null,{"$f":"VLOOKUP(H19,Teilnehmer!$B$5:$F$34,3,FALSE)","v":{"$error":"#N/A"}},{"$f":"VLOOKUP(H19,Teilnehmer!$B$5:$F$34,4,FALSE)","v":{"$error":"#N/A"}},{"$f":"VLOOKUP(H19,Teilnehmer!$B$5:$F$34,5,FALSE)","v":{"$error":"#N/A"}},null,null,{"$f":"VLOOKUP(M19,Teilnehmer!$B$5:$F$34,3,FALSE)","v":{"$error":"#N/A"}},{"$f":"VLOOKUP(M19,Teilnehmer!$B$5:$F$34,4,FALSE)","v":{"$error":"#N/A"}},{"$f":"VLOOKUP(M19,Teilnehmer!$B$5:$F$34,5,FALSE)","v":{"$error":"#N/A"}}]
[16,16,null,{"$f":"VLOOKUP(C20,Teilnehmer!$B$5:$F$34,3,FALSE)","v":{"$error":"#N/A"}},{"$f":"VLOOKUP(C20,Teilnehmer!$B$5:$F$34,4,FALSE)","v":{"$error":"#N/A"}},{"$f":"VLOOKUP(C20,Teilnehmer!$B$5:$F$34,5,FALSE)","v":{"$error":"#N/A"}},null,null,{"$f":"VLOOKUP(H20,Teilnehmer!$B$5:$F$34,3,FALSE)","v":{"$error":"#N/A"}},{"$f":"VLOOKUP(H20,Teilnehmer!$B$5:$F$34,4,FALSE)","v":{"$error":"#N/A"}},{"$f":"VLOOKUP(H20,Teilnehmer!$B$5:$F$34,5,FALSE)","v":{"$error":"#N/A"}},null,null,{"$f":"VLOOKUP(M20,Teilnehmer!$B$5:$F$34,3,FALSE)","v":{"$error":"#N/A"}},{"$f":"VLOOKUP(M20,Teilnehmer!$B$5:$F$34,4,FALSE)","v":{"$error":"#N/A"}},{"$f":"VLOOKUP(M20,Teilnehmer!$B$5:$F$34,5,FALSE)","v":{"$error":"#N/A"}}]
[17,17,null,{"$f":"VLOOKUP(C21,Teilnehmer!$B$5:$F$34,3,FALSE)","v":{"$error":"#N/A"}},{"$f":"VLOOKUP(C21,Teilnehmer!$B$5:$F$34,4,FALSE)","v":{"$error":"#N/A"}},{"$f":"VLOOKUP(C21,Teilnehmer!$B$5:$F$34,5,FALSE)","v":{"$error":"#N/A"}},null,null,{"$f":"VLOOKUP(H21,Teilnehmer!$B$5:$F$34,3,FALSE)","v":{"$error":"#N/A"}},{"$f":"VLOOKUP(H21,Teilnehmer!$B$5:$F$34,4,FALSE)","v":{"$error":"#N/A"}},{"$f":"VLOOKUP(H21,Teilnehmer!$B$5:$F$34,5,FALSE)","v":{"$error":"#N/A"}},null,null,{"$f":"VLOOKUP(M21,Teilnehmer!$B$5:$F$34,3,FALSE)","v":{"$error":"#N/A"}},{"$f":"VLOOKUP(M21,Teilnehmer!$B$5:$F$34,4,FALSE)","v":{"$error":"#N/A"}},{"$f":"VLOOKUP(M21,Teilnehmer!$B$5:$F$34,5,FALSE)","v":{"$error":"#N/A"}}]
[18,18,null,{"$f":"VLOOKUP(C22,Teilnehmer!$B$5:$F$34,3,FALSE)","v":{"$error":"#N/A"}},{"$f":"VLOOKUP(C22,Teilnehmer!$B$5:$F$34,4,FALSE)","v":{"$error":"#N/A"}},{"$f":"VLOOKUP(C22,Teilnehmer!$B$5:$F$34,5,FALSE)","v":{"$error":"#N/A"}},null,null,{"$f":"VLOOKUP(H22,Teilnehmer!$B$5:$F$34,3,FALSE)","v":{"$error":"#N/A"}},{"$f":"VLOOKUP(H22,Teilnehmer!$B$5:$F$34,4,FALSE)","v":{"$error":"#N/A"}},{"$f":"VLOOKUP(H22,Teilnehmer!$B$5:$F$34,5,FALSE)","v":{"$error":"#N/A"}},null,null,{"$f":"VLOOKUP(M22,Teilnehmer!$B$5:$F$34,3,FALSE)","v":{"$error":"#N/A"}},{"$f":"VLOOKUP(M22,Teilnehmer!$B$5:$F$34,4,FALSE)","v":{"$error":"#N/A"}},{"$f":"VLOOKUP(M22,Teilnehmer!$B$5:$F$34,5,FALSE)","v":{"$error":"#N/A"}}]
[1,19,null,{"$f":"VLOOKUP(C23,Teilnehmer!$B$5:$F$34,3,FALSE)","v":{"$error":"#N/A"}},{"$f":"VLOOKUP(C23,Teilnehmer!$B$5:$F$34,4,FALSE)","v":{"$error":"#N/A"}},{"$f":"VLOOKUP(C23,Teilnehmer!$B$5:$F$34,5,FALSE)","v":{"$error":"#N/A"}},null,null,{"$f":"VLOOKUP(H23,Teilnehmer!$B$5:$F$34,3,FALSE)","v":{"$error":"#N/A"}},{"$f":"VLOOKUP(H23,Teilnehmer!$B$5:$F$34,4,FALSE)","v":{"$error":"#N/A"}},{"$f":"VLOOKUP(H23,Teilnehmer!$B$5:$F$34,5,FALSE)","v":{"$error":"#N/A"}},null,null,{"$f":"VLOOKUP(M23,Teilnehmer!$B$5:$F$34,3,FALSE)","v":{"$error":"#N/A"}},{"$f":"VLOOKUP(M23,Teilnehmer!$B$5:$F$34,4,FALSE)","v":{"$error":"#N/A"}},{"$f":"VLOOKUP(M23,Teilnehmer!$B$5:$F$34,5,FALSE)","v":{"$error":"#N/A"}}]
[1,20,null,{"$f":"VLOOKUP(C24,Teilnehmer!$B$5:$F$34,3,FALSE)","v":{"$error":"#N/A"}},{"$f":"VLOOKUP(C24,Teilnehmer!$B$5:$F$34,4,FALSE)","v":{"$error":"#N/A"}},{"$f":"VLOOKUP(C24,Teilnehmer!$B$5:$F$34,5,FALSE)","v":{"$error":"#N/A"}},null,null,{"$f":"VLOOKUP(H24,Teilnehmer!$B$5:$F$34,3,FALSE)","v":{"$error":"#N/A"}},{"$f":"VLOOKUP(H24,Teilnehmer!$B$5:$F$34,4,FALSE)","v":{"$error":"#N/A"}},{"$f":"VLOOKUP(H24,Teilnehmer!$B$5:$F$34,5,FALSE)","v":{"$error":"#N/A"}},null,null,{"$f":"VLOOKUP(M24,Teilnehmer!$B$5:$F$34,3,FALSE)","v":{"$error":"#N/A"}},{"$f":"VLOOKUP(M24,Teilnehmer!$B$5:$F$34,4,FALSE)","v":{"$error":"#N/A"}},{"$f":"VLOOKUP(M24,Teilnehmer!$B$5:$F$34,5,FALSE)","v":{"$error":"#N/A"}}]
[1,21,null,{"$f":"VLOOKUP(C25,Teilnehmer!$B$5:$F$34,3,FALSE)","v":{"$error":"#N/A"}},{"$f":"VLOOKUP(C25,Teilnehmer!$B$5:$F$34,4,FALSE)","v":{"$error":"#N/A"}},{"$f":"VLOOKUP(C25,Teilnehmer!$B$5:$F$34,5,FALSE)","v":{"$error":"#N/A"}},null,null,{"$f":"VLOOKUP(H25,Teilnehmer!$B$5:$F$34,3,FALSE)","v":{"$error":"#N/A"}},{"$f":"VLOOKUP(H25,Teilnehmer!$B$5:$F$34,4,FALSE)","v":{"$error":"#N/A"}},{"$f":"VLOOKUP(H25,Teilnehmer!$B$5:$F$34,5,FALSE)","v":{"$error":"#N/A"}},null,null,{"$f":"VLOOKUP(M25,Teilnehmer!$B$5:$F$34,3,FALSE)","v":{"$error":"#N/A"}},{"$f":"VLOOKUP(M25,Teilnehmer!$B$5:$F$34,4,FALSE)","v":{"$error":"#N/A"}},{"$f":"VLOOKUP(M25,Teilnehmer!$B$5:$F$34,5,FALSE)","v":{"$error":"#N/A"}}]
[1,22,null,{"$f":"VLOOKUP(C26,Teilnehmer!$B$5:$F$34,3,FALSE)","v":{"$error":"#N/A"}},{"$f":"VLOOKUP(C26,Teilnehmer!$B$5:$F$34,4,FALSE)","v":{"$error":"#N/A"}},{"$f":"VLOOKUP(C26,Teilnehmer!$B$5:$F$34,5,FALSE)","v":{"$error":"#N/A"}},null,null,{"$f":"VLOOKUP(H26,Teilnehmer!$B$5:$F$34,3,FALSE)","v":{"$error":"#N/A"}},{"$f":"VLOOKUP(H26,Teilnehmer!$B$5:$F$34,4,FALSE)","v":{"$error":"#N/A"}},{"$f":"VLOOKUP(H26,Teilnehmer!$B$5:$F$34,5,FALSE)","v":{"$error":"#N/A"}},null,null,{"$f":"VLOOKUP(M26,Teilnehmer!$B$5:$F$34,3,FALSE)","v":{"$error":"#N/A"}},{"$f":"VLOOKUP(M26,Teilnehmer!$B$5:$F$34,4,FALSE)","v":{"$error":"#N/A"}},{"$f":"VLOOKUP(M26,Teilnehmer!$B$5:$F$34,5,FALSE)","v":{"$error":"#N/A"}}]
[1,23,null,{"$f":"VLOOKUP(C27,Teilnehmer!$B$5:$F$34,3,FALSE)","v":{"$error":"#N/A"}},{"$f":"VLOOKUP(C27,Teilnehmer!$B$5:$F$34,4,FALSE)","v":{"$error":"#N/A"}},{"$f":"VLOOKUP(C27,Teilnehmer!$B$5:$F$34,5,FALSE)","v":{"$error":"#N/A"}},null,null,{"$f":"VLOOKUP(H27,Teilnehmer!$B$5:$F$34,3,FALSE)","v":{"$error":"#N/A"}},{"$f":"VLOOKUP(H27,Teilnehmer!$B$5:$F$34,4,FALSE)","v":{"$error":"#N/A"}},{"$f":"VLOOKUP(H27,Teilnehmer!$B$5:$F$34,5,FALSE)","v":{"$error":"#N/A"}},null,null,{"$f":"VLOOKUP(M27,Teilnehmer!$B$5:$F$34,3,FALSE)","v":{"$error":"#N/A"}},{"$f":"VLOOKUP(M27,Teilnehmer!$B$5:$F$34,4,FALSE)","v":{"$error":"#N/A"}},{"$f":"VLOOKUP(M27,Teilnehmer!$B$5:$F$34,5,FALSE)","v":{"$error":"#N/A"}}]
[1,24,null,{"$f":"VLOOKUP(C28,Teilnehmer!$B$5:$F$34,3,FALSE)","v":{"$error":"#N/A"}},{"$f":"VLOOKUP(C28,Teilnehmer!$B$5:$F$34,4,FALSE)","v":{"$error":"#N/A"}},{"$f":"VLOOKUP(C28,Teilnehmer!$B$5:$F$34,5,FALSE)","v":{"$error":"#N/A"}},null,null,{"$f":"VLOOKUP(H28,Teilnehmer!$B$5:$F$34,3,FALSE)","v":{"$error":"#N/A"}},{"$f":"VLOOKUP(H28,Teilnehmer!$B$5:$F$34,4,FALSE)","v":{"$error":"#N/A"}},{"$f":"VLOOKUP(H28,Teilnehmer!$B$5:$F$34,5,FALSE)","v":{"$error":"#N/A"}},null,null,{"$f":"VLOOKUP(M28,Teilnehmer!$B$5:$F$34,3,FALSE)","v":{"$error":"#N/A"}},{"$f":"VLOOKUP(M28,Teilnehmer!$B$5:$F$34,4,FALSE)","v":{"$error":"#N/A"}},{"$f":"VLOOKUP(M28,Teilnehmer!$B$5:$F$34,5,FALSE)","v":{"$error":"#N/A"}}]
[1,25,null,{"$f":"VLOOKUP(C29,Teilnehmer!$B$5:$F$34,3,FALSE)","v":{"$error":"#N/A"}},{"$f":"VLOOKUP(C29,Teilnehmer!$B$5:$F$34,4,FALSE)","v":{"$error":"#N/A"}},{"$f":"VLOOKUP(C29,Teilnehmer!$B$5:$F$34,5,FALSE)","v":{"$error":"#N/A"}},null,null,{"$f":"VLOOKUP(H29,Teilnehmer!$B$5:$F$34,3,FALSE)","v":{"$error":"#N/A"}},{"$f":"VLOOKUP(H29,Teilnehmer!$B$5:$F$34,4,FALSE)","v":{"$error":"#N/A"}},{"$f":"VLOOKUP(H29,Teilnehmer!$B$5:$F$34,5,FALSE)","v":{"$error":"#N/A"}},null,null,{"$f":"VLOOKUP(M29,Teilnehmer!$B$5:$F$34,3,FALSE)","v":{"$error":"#N/A"}},{"$f":"VLOOKUP(M29,Teilnehmer!$B$5:$F$34,4,FALSE)","v":{"$error":"#N/A"}},{"$f":"VLOOKUP(M29,Teilnehmer!$B$5:$F$34,5,FALSE)","v":{"$error":"#N/A"}}]
[1,26,null,{"$f":"VLOOKUP(C30,Teilnehmer!$B$5:$F$34,3,FALSE)","v":{"$error":"#N/A"}},{"$f":"VLOOKUP(C30,Teilnehmer!$B$5:$F$34,4,FALSE)","v":{"$error":"#N/A"}},{"$f":"VLOOKUP(C30,Teilnehmer!$B$5:$F$34,5,FALSE)","v":{"$error":"#N/A"}},null,null,{"$f":"VLOOKUP(H30,Teilnehmer!$B$5:$F$34,3,FALSE)","v":{"$error":"#N/A"}},{"$f":"VLOOKUP(H30,Teilnehmer!$B$5:$F$34,4,FALSE)","v":{"$error":"#N/A"}},{"$f":"VLOOKUP(H30,Teilnehmer!$B$5:$F$34,5,FALSE)","v":{"$error":"#N/A"}},null,null,{"$f":"VLOOKUP(M30,Teilnehmer!$B$5:$F$34,3,FALSE)","v":{"$error":"#N/A"}},{"$f":"VLOOKUP(M30,Teilnehmer!$B$5:$F$34,4,FALSE)","v":{"$error":"#N/A"}},{"$f":"VLOOKUP(M30,Teilnehmer!$B$5:$F$34,5,FALSE)","v":{"$error":"#N/A"}}]

{"sheet":"Protokoll","index":8,"n_rows":28,"n_cols":6,"rows_kept":28,"cut":false,"hidden":false,"merged":[[27,1,27,2],[0,0,0,3],[10,8,10,11],[1,0,1,3]]}
[null,null,null,null,105,"<< hier Startnummer eintragen"]
[null,null,null,null,109]
[{"$f":"E1","v":105},{"$f":"VLOOKUP($E$1,Teilnehmer!$B$5:$F$46,5,FALSE)","v":"H"},{"$f":"CONCATENATE(VLOOKUP($E$1,Teilnehmer!$B$5:$F$46,3,FALSE),\",  \",VLOOKUP($E$1,Teilnehmer!$B$5:$F$46,4,FALSE))","v":"Bischoff,  Andreas"}]
[]
[]
["Bahn","Runde 1","Runde 2","Stechen"]
[1,null,null,null,"1xx","Herren"]
[2,null,null,null,"2xx","Damen"]
[3,null,null,null,"3xx","Jugend"]
[4,null,null,null,"4xx","Schüler"]
[5]
[6]
[7]
[8]
[9]
[10]
[11]
[12]
[13]
[14]
[15]
[16]
[17]
[18]
["Summe"]
["Unterschr."]
[]
["Total"]

{"sheet":"Urkundendruck","index":9,"n_rows":26,"n_cols":7,"rows_kept":26,"cut":false,"hidden":false,"merged":[]}
[]
[]
[]
[]
[]
[]
[]
[]
[]
[]
[]
[]
[]
[]
[]
[null,null,null,null,"Startnummer:",105,{"$f":"INT(F16/100)*100","v":100}]
[]
[null,{"$f":"CONCATENATE(VLOOKUP($F$16,Teilnehmer!$B$4:$F$34,4,FALSE),\" \",VLOOKUP($F$16,Teilnehmer!$B$4:$F$34,3,FALSE))","v":"Andreas Bischoff"}]
[]
[null,"hat beim Minigolf Jedermannturnier"]
[null,"des BGSV Bad Homburg den"]
[]
[null,{"$f":"CONCATENATE(VLOOKUP($F$16,Teilnehmer!$B$4:$F$34,2,FALSE),\". Platz\")","v":"5. Platz"}]
[]
[null,{"$f":"CONCATENATE(\"in der Kategorie \",(VLOOKUP($G$16,Teilnehmer!$B$4:$F$34,5,FALSE)))","v":{"$error":"#N/A"}}]
[null,{"$f":"CONCATENATE(\"mit \",VLOOKUP($F$16,Teilnehmer!$B$4:$H$34,12,FALSE),\" Schlägen aus 2 Runden erreicht.\")","v":{"$error":"#REF!"}}]